{"text_format":"1","workbook":"xlsx","n_sheets":3,"sheets":["Start","Управление","Правила"],"not_rendered":{"charts":0,"images":32,"macros":1,"external_links":0,"defined_names":20,"comments":2,"pivot_tables":0},"unopened":[],"bounds":{"document_bytes":16777216,"sheet_cells":100000,"rows_first":2000,"rows_last":500,"rows_between":2000,"halvings":0,"cell_chars":16384,"cell_head_chars":4096},"cells_cut":0,"cells_raw":0,"read":"whole","date_system":"1900"}

{"sheet":"Start","index":0,"n_rows":10,"n_cols":9,"rows_kept":10,"cut":false,"hidden":false,"merged":[[8,8,8,10],[9,8,9,10]]}
["Файл:",{"$f":"IF(c_DocPath=0,\"\",c_DocPath)","v":"C:\\Users\\ArietZ\\Desktop\\t\\Этап 1. Сводный отчет_v1.docx"}]
[]
[]
[]
[]
[]
[]
[]
[null,null,null,null,null,null,null,null,"Количество несоответствий"]
[null,null,null,null,null,null,null,null,{"$f":"Управление!E28","v":0}]

{"sheet":"Управление","index":1,"n_rows":38,"n_cols":15,"rows_kept":38,"cut":false,"hidden":false,"merged":[[36,3,36,5],[7,13,7,14],[20,1,20,5],[21,1,21,5],[8,1,9,5],[6,1,7,6],[13,1,14,8],[22,1,22,4],[13,9,14,15],[19,1,19,5],[18,10,18,11]]}
[null,"1. Выберите файл отчета",null,null,null,null,null,null,null,"5. Выберите шаблон стилей"]
[null,"Файл:","C:\\Users\\ArietZ\\Desktop\\t\\Этап 1. Сводный отчет_v1.docx",null,null,null,null,null,null,"Шаблон:","%APPDATA%\\Microsoft\\Шаблоны\\02 Отчет.dotx"]
[null,null,null,null,null,null,null,null,null,{"$f":"B2","v":"Файл:"},{"$f":"IF(c_DocPath=0,\"\",c_DocPath)","v":"C:\\Users\\ArietZ\\Desktop\\t\\Этап 1. Сводный отчет_v1.docx"}]
[null,"2. Выберите правила и исключения"]
[]
[]
[null,"3. Запустите проверку"]
[null,null,null,null,null,null,null,null,null,null,null,null,null,"Результат"]
[null,"Настройка отображения несоответствий",null,null,null,null,null,null,null,null,null,null,null,"Всего стилей",0]
[null,null,null,null,null,null,null,null,null,null,null,null,null,"Удалено",0]
[null,null,null,null,null,null,null,"Если виснет…",null,null,null,null,null,"Переименовано",0]
[]
[]
[null,"4. Запустите исправление несоответствий",null,null,null,null,null,null,null,"6. Дополнительные возможности"]
[]
[null,"Настройка режима внесения изменений"]
[]
[]
[null,null,null,null,null,null,null,null,null,null,"Перекодировка"]
[null,null,null,null,null,null,null,null,null,null,"Исходная","CP1251"]
[null,null,null,null,null,null,null,null,null,null,"Целевая","CP866"]
[null,null,null,null,null,null,null,null,null,null,"* Перечень кодировок можно посмотреть тут: regedit HKEY_CLASSES_ROOT\\MIME\\Database\\Charset"]
[null,"Статистика"]
[null,"Всего правил",null,null,{"$f":"COUNTA(Правила!A:A) - 1","v":30}]
[null,"С автоисправлением",null,null,{"$f":"COUNTIF(Правила!D:D,\"да\")","v":30}]
[null,"Включенных",null,null,{"$f":"COUNTIF(Правила!C:C,\"да\")","v":29}]
[null,"Нарушенных",null,null,{"$f":"COUNTIF(Правила!G:G,\">0\")","v":0}]
[null,"Всего несоответствий",null,null,{"$f":"SUM(Правила!G:G)","v":0}]
[null,"Исправлено",null,null,{"$f":"SUM(Правила!H:H)","v":0}]
[null,"Осталось исправить",null,null,{"$f":"E28-E29","v":0}]
[null,"Страниц в документе",null,null,308]
[null,"Несоответствий на 100 страниц",null,null,{"$f":"c_ErrCount/E31*100","v":0}]
[]
[null,null,null,"Тестирование и отладка"]
[]
[null,null,null,"Выполнение одного правила"]
[null,null,null,"Запрещенные слова"]
[null,null,null,"ID",{"$f":"INDEX(Правила!A:A, MATCH(c_TheOnlyRuleName, Правила!B:B,0))","v":"AR1020"},{"$f":"MATCH(c_TheOnlyRuleName, Правила!B:B,0) - 1","v":19}]

{"sheet":"Правила","index":2,"n_rows":31,"n_cols":9,"rows_kept":31,"cut":false,"hidden":false,"merged":[]}
["ID","Имя","Вкл","Испр","Группа","Описание","Errors","Fixes","Time"]
["AR1001","Пробел в начале / конце абзаца","да","да","Автозамены","Пробел в начале / конце абзаца. Ошибка часто возникает при работе со списками",0,0,0]
["AR1002","Два пробела подряд","да","да","Форматирование","Замена двойных пробелов на одинарные. Для формирования отступов рекомендуются использоваться позиции табуляции или табуляторы",0,0,0]
["AR1003","Два абзаца подряд ","да","да","Форматирование","Двойной абзац -> одинарный (вместо них должны использоваться отступы абзацные)",0,0,0]
["AR1004","Знак \"плюс-минус\"","да","да","Автозамены","«+/-» => «±»",0,0,0]
["AR1005","Использование длинного тире","да","да","Автозамены","Если дефис (тире) окружен пробелами, то это длинное тире",0,0,0]
["AR1006","Использование дефиса","да","да","Автозамены","Если тире окружено буквами, то это дефис",0,0,0]
["AR1007","Знак номера №","да","да","Автозамены","N => №. После этого символа идёт символ неразрывного пробела",0,0,0]
["AR1008","Подозрительное использование дефисов","да","да","Ошибки","Ошибки в отделении тире пробелом только с одной из сторон, пробелы в числовых диапазонах",0,0,0]
["AR1009","Многоточие","да","да","Автозамены","Три и больше точки заменяются на символ многоточия",0,0,0]
["AR1010","Точка в конце заголовка запрещена","да","да","Форматирование","Точки в конце заголовка допустимы только, если это сокращение",0,0,0]
["AR1011","Сокращения г. / гг.","да","да","Автозамены","Сокращение «г.» и «гг.» после цифр предваряются неразрывным пробелом",0,0,0]
["AR1012","Пробел в табл. и рис.","да","да","Автозамены","После «рис.», «табл.» идёт неразрывный пробел",0,0,0]
["AR1013","Формулы в тексте запрещены","да","да","Автозамены","Формулы должны быть вставлены как объекты. Запрет на использование знака «=» вне объектов-формул.",0,0,0]
["AR1014","НП ЦИВТ КОНЦЕПТ","да","да","Автозамены","НП ЦИВТ КОНЦЕПТ нужно писать с неразрывными пробелами",0,0,0]
["AR1016","И. О. Фамилия","да","да","Автозамены","Инициалы идут до фамилии, разделенные неразрывными пробелами",0,0,0]
["AR1017","Кавычки","да","да","Автозамены","Кавычки только «» или для вложенных „”. Уровень вложенности не должен превышать 3. Также недопустимо использование двух открывающихся кавычек подряд, а также двух закрывающихся кавычек одоного типа подряд",0,0,0]
["AR1018","Пунктуация в конце ячейки","да","да","Форматирование","Расстояние между строками нужно задавать пустыми строками и их размером, а не переносами строки. Точки не допустимы",0,0,0]
["AR1019","Абзацы не более 10 строк","да","да","Семантика","Слишком длинные абзацы сложны для восприятия. Нужно разбивать на более мелкие. За ошибку не считаются абзацы длиной менее 80 слов (если слова длинные, то может быть больше 10 строк)",0,0,0]
["AR1020","Запрещенные слова","да","да","Семантика","В отчетах запрещено использование некоторых слов (см. список в Параметрах)",0,0,0]
["AR1021","Макетирование списков","да","да","Макетирование","Абзац перед списком не должен отрываться от списка",0,0,0]
["AR1022","Пунктуация в списках","да","да","Автозамены","Список должен оканчиваться точкой. В конце каждого пункта должен стоять знак препинания",0,0,0]
["AR1023","Неразрывный пробел в сокращениях","да","да","Автозамены","Неразрывный пробел после п., пп., ст., ч.",0,0,0]
["AR1024","Скобочные структуры","да","да","Автозамены","Некорректная скобочная последовательность",0,0,0]
["AR1025","Нумерованные списки","да","да","Автозамены","Новый нумерованный список должен начинаться с единицы",0,0,0]
["AR1026","Исправление сокращений","да","да","Автозамены","Раскрытие сокращений или замена разделителей",0,0,0]
["AR1027","Исправление полей","да","да","Автозамены","Поля рис. и табл. строчными буквами",0,0,0]
["AR1028","Пробелы перед сносками","да","да","Автозамены","Перед сносками не должно быть пробелов",0,0,0]
["AR1029","Замена и/или","да","да","Автозамены","Замена \"и/или\" на \"и (или)\"",0,0,0]
["AR1098","Стандартный корректор Word","нет","да","Грамматика","Не должно быть претензий у стандартного проверяльщика",0,0,0]
["AR1099","Неработающее поле","да","да","Ошибки","Все поля в документе должны работать",0,0,0]